Reaction Details
TargetPapain
LigandBDBM20095
Substrate/CompetitorBDBM20081
Meas. Tech.Papain Inhibition Assay
pH6.5±n/a
Temperature298.15±n/a K
Ki 260±10 nM
Km965000±244000 nM
Citation Löser, RSchilling, KDimmig, EGütschow, M Interaction of papain-like cysteine proteases with dipeptide-derived nitriles. J Med Chem48:7688-707 (2005) 
 
Papain
Name:Papain
Type:Enzyme
Mol. Mass.:38923.01
Organism:Carica papaya
Description:Papain was purchased from Sigma, Germany.
Residue:345
BDBM20095
BDBM20081
NameBDBM20095
Synonyms:dipeptide-derived nitrile, 16 | tert-butyl N-[(1S)-1-[(cyanomethyl)carbamoyl]-2-phenylethyl]carbamate
TypeSmall organic molecule
Emp. Form.C16H21N3O3
Mol. Mass.303.3562
SMILESCC(C)(C)OC(=O)N[C@@H](Cc1ccccc1)C(=O)NCC#N