Reaction Details
TargetPapain
LigandBDBM20107
Substrate/CompetitorBDBM20081
Meas. Tech.Papain Inhibition Assay
pH6.5±n/a
Temperature298.15±n/a K
Ki 29±1 nM
Km965000±244000 nM
Citation Löser, RSchilling, KDimmig, EGütschow, M Interaction of papain-like cysteine proteases with dipeptide-derived nitriles. J Med Chem48:7688-707 (2005) 
 
Papain
Name:Papain
Type:Enzyme
Mol. Mass.:38923.01
Organism:Carica papaya
Description:Papain was purchased from Sigma, Germany.
Residue:345
BDBM20107
BDBM20081
NameBDBM20107
Synonyms:dipeptide-derived nitrile, 28 | tert-butyl N-[(1S)-2-(4-bromophenyl)-1-[(cyanomethyl)carbamoyl]ethyl]carbamate
TypeSmall organic molecule
Emp. Form.C16H20BrN3O3
Mol. Mass.382.252
SMILESCC(C)(C)OC(=O)N[C@@H](Cc1ccc(Br)cc1)C(=O)NCC#N