Reaction Details
TargetSigma non-opioid intracellular receptor 1
LigandBDBM50199806
Substrate/Competitorn/a
Meas. Tech.Uptake Assays
Ki 0.940±0.07 nM
Citation Newman, AHOkunola-Bakare, OMCao, J Potent and selective inhibitors of monoamine transporters; method of making; and use thereof US Patent US9862679 Publication Date 1/9/2018
 
Sigma non-opioid intracellular receptor 1
Name:Sigma non-opioid intracellular receptor 1
Type:Enzyme Catalytic Domain
Mol. Mass.:25266.54
Organism:RAT
Description:Q9R0C9
Residue:223
BDBM50199806
NameBDBM50199806
Synonyms:CHEMBL3944169 US11555013, Compound 9a | US9862679, Compound 9a
TypeSmall organic molecule
Emp. Form.C22H30N2OS
Mol. Mass.370.551
SMILESCC(O)CN1CCN(CCSC(c2ccccc2)c2ccccc2)CC1