Reaction Details
TargetSodium-dependent serotonin transporter
LigandBDBM364427
Substrate/Competitorn/a
Meas. Tech.Serotonin Transporter Binding Assay
Ki>100000±n/a nM
Citation Newman, AHOkunola-Bakare, OMCao, J Potent and selective inhibitors of monoamine transporters; method of making; and use thereof US Patent US9862679 Publication Date 1/9/2018
 
Sodium-dependent serotonin transporter
Name:Sodium-dependent serotonin transporter
Type:Multi-pass membrane protein
Mol. Mass.:70168.43
Organism:Rattus norvegicus (rat)
Description:P31652
Residue:630
BDBM364427
NameBDBM364427
Synonyms:US10913711, Compound 10a US9862679, Compound 10a
TypeSmall organic molecule
Emp. Form.C22H30N2O2S
Mol. Mass.386.551
SMILESCC(O)CN1CCN(CCS(=O)C(c2ccccc2)c2ccccc2)CC1