Reaction Details
TargetOxysterols receptor LXR-alpha
LigandBDBM20132
Substrate/CompetitorBDBM19992
Meas. Tech.Scintillation Proximity Assay
IC50 5000±n/a nM
Citation Molteni, VLi, XNabakka, JLiang, FWityak, JKoder, AVargas, LRomeo, RMitro, NMak, PASeidel, HMHaslam, JAChow, DTuntland, TSpalding, TABrock, ABradley, MCastrillo, ATontonoz, PSaez, E N-Acylthiadiazolines, a new class of liver X receptor agonists with selectivity for LXRbeta. J Med Chem50:4255-9 (2007) 
 
Oxysterols receptor LXR-alpha
Name:Oxysterols receptor LXR-alpha
Type:Enzyme Catalytic Domain
Mol. Mass.:50403.85
Organism:Homo sapiens (Human)
Description:Q13133
Residue:447
BDBM20132
BDBM19992
NameBDBM20132
Synonyms:(2R)-5-(4-chlorophenyl)-2-(2,3-dimethoxyphenyl)-3-[(2,4,6-trifluorophenyl)carbonyl]-2,3-dihydro-1,3,4-thiadiazole | N-Acylthiadiazoline, 3-R
TypeSmall organic molecule
Emp. Form.C23H16ClF3N2O3S
Mol. Mass.492.898
SMILESCOc1cccc([C@H]2SC(=NN2C(=O)c2c(F)cc(F)cc2F)c2ccc(Cl)cc2)c1OC