Reaction Details
TargetP2X purinoceptor 7
LigandBDBM246865
Substrate/Competitorn/a
Meas. Tech.P2X7 Radioligand Binding
Ki 1.10±n/a nM
Citation Ameriks, MKRech, JCSavall, BMWall, JL Substituted [1,2,4]triazolo[4,3-a]pyrazines as P2X7 modulators US Patent US10053463 Publication Date 8/21/2018
 
P2X purinoceptor 7
Name:P2X purinoceptor 7
Type:PROTEIN
Mol. Mass.:68405.16
Organism:Mus musculus
Description:ChEMBL_1473824
Residue:595
BDBM246865
NameBDBM246865
Synonyms:6-(trifluoromethyl)picolinohydrazide | US10053463, 16
TypeSmall organic molecule
Emp. Form.C7H6F3N3O
Mol. Mass.205.1372
SMILESNNC(=O)c1cccc(n1)C(F)(F)F