Reaction Details
TargetP2X purinoceptor 7
LigandBDBM160077
Substrate/Competitorn/a
Meas. Tech.P2X7 Radioligand Binding
Ki 5.00±n/a nM
Citation Ameriks, MKRech, JCSavall, BMWall, JL Substituted [1,2,4]triazolo[4,3-a]pyrazines as P2X7 modulators US Patent US10053463 Publication Date 8/21/2018
 
P2X purinoceptor 7
Name:P2X purinoceptor 7
Type:Protein
Mol. Mass.:68602.85
Organism:Homo sapiens (Human)
Description:Q99572
Residue:595
BDBM160077
NameBDBM160077
Synonyms:US10047092, 18 US9040534, 18
TypeSmall organic molecule
Emp. Form.C19H15ClF3N5O
Mol. Mass.421.804
SMILESC[C@H]1Cn2c(nnc2-c2ccccn2)C(=O)N1Cc1cccc(c1Cl)C(F)(F)F