Reaction Details
TargetP2X purinoceptor 7
LigandBDBM48901
Substrate/Competitorn/a
Meas. Tech.P2X7 Radioligand Binding
Ki 0.400±n/a nM
Citation Ameriks, MKRech, JCSavall, BMWall, JL Substituted [1,2,4]triazolo[4,3-a]pyrazines as P2X7 modulators US Patent US10053463 Publication Date 8/21/2018
 
P2X purinoceptor 7
Name:P2X purinoceptor 7
Type:PROTEIN
Mol. Mass.:68405.16
Organism:Mus musculus
Description:ChEMBL_1473824
Residue:595
BDBM48901
NameBDBM48901
Synonyms:BDBM160086 US10053463, 27 | US9040534, 72
Typen/a
Emp. Form.C18H14ClF3N6O
Mol. Mass.422.792
SMILESC[C@H]1Cn2c(nnc2-c2ncccn2)C(=O)N1Cc1cccc(c1Cl)C(F)(F)F