Reaction Details
TargetP2X purinoceptor 7
LigandBDBM160130
Substrate/Competitorn/a
Meas. Tech.P2X7 FLIPR Assay
pH7.4±n/a
IC50 5.60±n/a nM
Commentsextracted
Citation Ameriks, MKRech, JCSavall, BMWall, JL Substituted [1,2,4]triazolo[4,3-a]pyrazines as P2X7 modulators US Patent US10053463 Publication Date 8/21/2018
 
P2X purinoceptor 7
Name:P2X purinoceptor 7
Type:PROTEIN
Mol. Mass.:68405.16
Organism:Mus musculus
Description:ChEMBL_1473824
Residue:595
BDBM160130
NameBDBM160130
Synonyms:US10047092, 72 US9040534, 71 | US9040534, 72
TypeSmall organic molecule
Emp. Form.C19H16ClF3N6O
Mol. Mass.436.818
SMILESCC[C@H]1Cn2c(nnc2-c2ncccn2)C(=O)N1Cc1cccc(c1Cl)C(F)(F)F