Reaction Details
TargetP2X purinoceptor 7
LigandBDBM246860
Substrate/Competitorn/a
Meas. Tech.P2X7 Radioligand Binding
Ki 2.50±n/a nM
Citation Ameriks, MKRech, JCSavall, BMWall, JL Substituted [1,2,4]triazolo[4,3-a]pyrazines as P2X7 modulators US Patent US10053463 Publication Date 8/21/2018
 
P2X purinoceptor 7
Name:P2X purinoceptor 7
Type:PROTEIN
Mol. Mass.:68405.16
Organism:Mus musculus
Description:ChEMBL_1473824
Residue:595
BDBM246860
NameBDBM246860
Synonyms:US10053463, 11 | pyridazine-3-carbohydrazide
TypeSmall organic molecule
Emp. Form.C5H6N4O
Mol. Mass.138.1273
SMILESNNC(=O)c1cccnn1