Reaction Details
TargetTransient receptor potential cation channel subfamily V member 1
LigandBDBM20322
Substrate/CompetitorBDBM20285
Meas. Tech.Competition Binding Assay and Inhibition of Ca2+ Uptake Assay
pH7.4±n/a
Temperature310.15±n/a K
Ki 54±11 nM
EC50 9.2±2.9 nM
Citation Chung, JUKim, SYLim, JOChoi, HKKang, SUYoon, HSRyu, HKang, DWLee, JKang, BChoi, SToth, APearce, LVPavlyukovets, VALundberg, DJBlumberg, PM Alpha-substituted N-(4-tert-butylbenzyl)-N'-[4-(methylsulfonylamino)benzyl]thiourea analogues as potent and stereospecific TRPV1 antagonists. Bioorg Med Chem15:6043-53 (2007) 
 
Transient receptor potential cation channel subfamily V member 1
Name:Transient receptor potential cation channel subfamily V member 1
Type:Transient Receptor
Mol. Mass.:94956.12
Organism:Rattus norvegicus (rat)
Description:O35433
Residue:838
BDBM20322
BDBM20285
NameBDBM20322
Synonyms:3-[(4-tert-butylphenyl)methyl]-1-[1-(3-fluoro-4-methanesulfonamidophenyl)ethyl]thiourea | thiourea analogue, 11
TypeSmall organic molecule
Emp. Form.C21H28FN3O2S2
Mol. Mass.437.594
SMILESCC(NC(=S)NCc1ccc(cc1)C(C)(C)C)c1ccc(NS(C)(=O)=O)c(F)c1