Reaction Details
TargetTransient receptor potential cation channel subfamily V member 1
LigandBDBM20330
Substrate/CompetitorBDBM20285
Meas. Tech.Competition Binding Assay and Inhibition of Ca2+ Uptake Assay
pH7.4±n/a
Temperature310.15±n/a K
Ki 51±17 nM
Citation Chung, JUKim, SYLim, JOChoi, HKKang, SUYoon, HSRyu, HKang, DWLee, JKang, BChoi, SToth, APearce, LVPavlyukovets, VALundberg, DJBlumberg, PM Alpha-substituted N-(4-tert-butylbenzyl)-N'-[4-(methylsulfonylamino)benzyl]thiourea analogues as potent and stereospecific TRPV1 antagonists. Bioorg Med Chem15:6043-53 (2007) 
 
Transient receptor potential cation channel subfamily V member 1
Name:Transient receptor potential cation channel subfamily V member 1
Type:Transient Receptor
Mol. Mass.:94956.12
Organism:Rattus norvegicus (rat)
Description:O35433
Residue:838
BDBM20330
BDBM20285
NameBDBM20330
Synonyms:3-[(4-tert-butylphenyl)methyl]-1-[(4-methanesulfonamido-3-methoxyphenyl)methyl]thiourea thiourea analogue, 3
TypeSmall organic molecule
Emp. Form.C21H29N3O3S2
Mol. Mass.435.603
SMILESCOc1cc(CNC(=S)NCc2ccc(cc2)C(C)(C)C)ccc1NS(C)(=O)=O