Reaction Details
TargetTransient receptor potential cation channel subfamily V member 1
LigandBDBM20460
Substrate/CompetitorBDBM20458
Meas. Tech.Radioligand Binding Assay and Agonist Ca2+ Influx Functional Assay
pH7.4±n/a
Temperature298.15±n/a K
Ki 1585±147 nM
EC50 132±76 nM
Citation Bianchi, BREl Kouhen, RNeelands, TRLee, CHGomtsyan, ARaja, SNVaidyanathan, SNSurber, BMcDonald, HASurowy, CSFaltynek, CRMoreland, RBJarvis, MFPuttfarcken, PS [3H]A-778317 [1-((R)-5-tert-butyl-indan-1-yl)-3-isoquinolin-5-yl-urea]: a novel, stereoselective, high-affinity antagonist is a useful radioligand for the human transient receptor potential vanilloid-1 (TRPV1) receptor. J Pharmacol Exp Ther323:285-93 (2007) 
 
Transient receptor potential cation channel subfamily V member 1
Name:Transient receptor potential cation channel subfamily V member 1
Type:Protein
Mol. Mass.:94960.75
Organism:Homo sapiens (Human)
Description:Q8NER1
Residue:839
BDBM20460
BDBM20458
NameBDBM20460
Synonyms:(9Z)-N-[(4-hydroxy-3-methoxyphenyl)methyl]octadec-9-enamide CHEMBL76903 Olvanil
Typen/a
Emp. Form.C26H43NO3
Mol. Mass.417.6245
SMILESCCCCCCCC\C=C/CCCCCCCC(=O)NCc1ccc(O)c(OC)c1