Reaction Details
TargetTransient receptor potential cation channel subfamily V member 1
LigandBDBM20466
Substrate/CompetitorBDBM20458
Meas. Tech.Radioligand Binding Assay and Antagonist Ca2+ Influx Functional Assay
pH7.4±n/a
Temperature298.15±n/a K
Ki 71±8 nM
EC50 74±23 nM
Citation Bianchi, BREl Kouhen, RNeelands, TRLee, CHGomtsyan, ARaja, SNVaidyanathan, SNSurber, BMcDonald, HASurowy, CSFaltynek, CRMoreland, RBJarvis, MFPuttfarcken, PS [3H]A-778317 [1-((R)-5-tert-butyl-indan-1-yl)-3-isoquinolin-5-yl-urea]: a novel, stereoselective, high-affinity antagonist is a useful radioligand for the human transient receptor potential vanilloid-1 (TRPV1) receptor. J Pharmacol Exp Ther323:285-93 (2007) 
 
Transient receptor potential cation channel subfamily V member 1
Name:Transient receptor potential cation channel subfamily V member 1
Type:Protein
Mol. Mass.:94960.75
Organism:Homo sapiens (Human)
Description:Q8NER1
Residue:839
BDBM20466
BDBM20458
NameBDBM20466
Synonyms:A-784168 N-[4-(trifluoromethane)sulfonylphenyl]-1-[3-(trifluoromethyl)pyridin-2-yl]-1,2,3,6-tetrahydropyridine-4-carboxamide
TypeSmall organic molecule
Emp. Form.C19H15F6N3O3S
Mol. Mass.479.396
SMILESFC(F)(F)c1cccnc1N1CCC(=CC1)C(=O)Nc1ccc(cc1)S(=O)(=O)C(F)(F)F