Reaction Details
TargetTransient receptor potential cation channel subfamily V member 1
LigandBDBM20468
Substrate/CompetitorBDBM20458
Meas. Tech.Radioligand Binding Assay and Antagonist Ca2+ Influx Functional Assay
pH7.4±n/a
Temperature298.15±n/a K
Ki 603±42 nM
EC50 95±2 nM
Citation Bianchi, BREl Kouhen, RNeelands, TRLee, CHGomtsyan, ARaja, SNVaidyanathan, SNSurber, BMcDonald, HASurowy, CSFaltynek, CRMoreland, RBJarvis, MFPuttfarcken, PS [3H]A-778317 [1-((R)-5-tert-butyl-indan-1-yl)-3-isoquinolin-5-yl-urea]: a novel, stereoselective, high-affinity antagonist is a useful radioligand for the human transient receptor potential vanilloid-1 (TRPV1) receptor. J Pharmacol Exp Ther323:285-93 (2007) 
 
Transient receptor potential cation channel subfamily V member 1
Name:Transient receptor potential cation channel subfamily V member 1
Type:Protein
Mol. Mass.:94960.75
Organism:Homo sapiens (Human)
Description:Q8NER1
Residue:839
BDBM20468
BDBM20458
NameBDBM20468
Synonyms:3-(2-bromophenyl)-1-{2-[ethyl(3-methylphenyl)amino]ethyl}urea | SB-452533
TypeSmall organic molecule
Emp. Form.C18H22BrN3O
Mol. Mass.376.291
SMILESCCN(CCNC(=O)Nc1ccccc1Br)c1cccc(C)c1