Reaction Details
TargetTransient receptor potential cation channel subfamily V member 1
LigandBDBM20481
Substrate/CompetitorBDBM10852
Meas. Tech.FLIPR (Fluorescence Imaging Plate Reader)-Based Ca2+ Assay
pH7.2±n/a
Temperature298.15±n/a K
EC50>251±n/a nM
Citation Rami, HKThompson, MWyman, PJerman, JCEgerton, JBrough, SStevens, AJRandall, ADSmart, DGunthorpe, MJDavis, JB Discovery of small molecule antagonists of TRPV1. Bioorg Med Chem Lett14:3631-4 (2004) 
 
Transient receptor potential cation channel subfamily V member 1
Name:Transient receptor potential cation channel subfamily V member 1
Type:Protein
Mol. Mass.:94960.75
Organism:Homo sapiens (Human)
Description:Q8NER1
Residue:839
BDBM20481
BDBM10852
NameBDBM20481
Synonyms:N-(2-{[(2-bromophenyl)carbamoyl]amino}ethyl)-N-(3-methylphenyl)acetamide | urea TRPV1 antagonist, 14
TypeSmall organic molecule
Emp. Form.C18H20BrN3O2
Mol. Mass.390.274
SMILESCC(=O)N(CCNC(=O)Nc1ccccc1Br)c1cccc(C)c1