Reaction Details
TargetTransient receptor potential cation channel subfamily V member 1
LigandBDBM20284
Substrate/CompetitorBDBM10852
Meas. Tech.FLIPR (Fluorescence Imaging Plate Reader)-Based Ca2+ Assay
pH7.2±n/a
Temperature298.15±n/a K
EC50 32±n/a nM
Citation Rami, HKThompson, MWyman, PJerman, JCEgerton, JBrough, SStevens, AJRandall, ADSmart, DGunthorpe, MJDavis, JB Discovery of small molecule antagonists of TRPV1. Bioorg Med Chem Lett14:3631-4 (2004) 
 
Transient receptor potential cation channel subfamily V member 1
Name:Transient receptor potential cation channel subfamily V member 1
Type:Protein
Mol. Mass.:94960.75
Organism:Homo sapiens (Human)
Description:Q8NER1
Residue:839
BDBM20284
BDBM10852
NameBDBM20284
Synonyms:CHEMBL391997 Capsazepine N-[2-(4-chlorophenyl)ethyl]-7,8-dihydroxy-2,3,4,5-tetrahydro-1H-2-benzazepine-2-carbothioamide
TypeSmall organic molecule
Emp. Form.C19H21ClN2O2S
Mol. Mass.376.9
SMILESOc1cc2CCCN(Cc2cc1O)C(=S)NCCc1ccc(Cl)cc1