Reaction Details
TargetTransient receptor potential cation channel subfamily V member 1
LigandBDBM20531
Substrate/CompetitorBDBM10852
Meas. Tech.Capsaicin Antagonist Assay
IC50 0.3±n/a nM
Citation Norman, MHZhu, JFotsch, CBo, YChen, NChakrabarti, PDoherty, EMGavva, NRNishimura, NNixey, TOgnyanov, VIRzasa, RMStec, MSurapaneni, STamir, RViswanadhan, VNTreanor, JJ Novel vanilloid receptor-1 antagonists: 1. Conformationally restricted analogues of trans-cinnamides. J Med Chem50:3497-514 (2007) 
 
Transient receptor potential cation channel subfamily V member 1
Name:Transient receptor potential cation channel subfamily V member 1
Type:Protein
Mol. Mass.:94960.75
Organism:Homo sapiens (Human)
Description:Q8NER1
Residue:839
BDBM20531
BDBM10852
NameBDBM20531
Synonyms:N-{6-[4-(trifluoromethyl)phenyl]pyrimidin-4-yl}quinolin-7-amine | Pyrimidine derivative, 79
TypeSmall organic molecule
Emp. Form.C20H13F3N4
Mol. Mass.366.3392
SMILESFC(F)(F)c1ccc(cc1)-c1cc(Nc2ccc3cccnc3c2)ncn1