Reaction Details
TargetTransient receptor potential cation channel subfamily V member 1
LigandBDBM20557
Substrate/CompetitorBDBM10852
Meas. Tech.Proton Antagonist Assay
IC50 0.5±n/a nM
Citation Doherty, EMFotsch, CBannon, AWBo, YChen, NDominguez, CFalsey, JGavva, NRKaton, JNixey, TOgnyanov, VIPettus, LRzasa, RMStec, MSurapaneni, STamir, RZhu, JTreanor, JJNorman, MH Novel vanilloid receptor-1 antagonists: 2. Structure-activity relationships of 4-oxopyrimidines leading to the selection of a clinical candidate. J Med Chem50:3515-27 (2007) 
 
Transient receptor potential cation channel subfamily V member 1
Name:Transient receptor potential cation channel subfamily V member 1
Type:Transient Receptor
Mol. Mass.:94956.12
Organism:Rattus norvegicus (rat)
Description:O35433
Residue:838
BDBM20557
BDBM10852
NameBDBM20557
Synonyms:AMG 517 JMC503515 Compound 23 US8796328, A | US8802711, H
TypeSmall organic molecule
Emp. Form.C20H13F3N4O2S
Mol. Mass.430.403
SMILESCC(=O)Nc1nc2c(Oc3cc(ncn3)-c3ccc(cc3)C(F)(F)F)cccc2s1