Reaction Details
TargetMitogen-activated protein kinase kinase kinase 12
LigandBDBM365231
Substrate/Competitorn/a
Meas. Tech.TR-FRET assay
Ki 0.735±n/a nM
Citation Cohen, FPatel, S C-linked heterocycloaklyl substituted pyrimidines and their uses US Patent US9868720 Publication Date 1/16/2018
 
Mitogen-activated protein kinase kinase kinase 12
Name:Mitogen-activated protein kinase kinase kinase 12
Type:PROTEIN
Mol. Mass.:93216.56
Organism:Homo sapiens (Human)
Description:ChEMBL_1460553
Residue:859
BDBM365231
NameBDBM365231
Synonyms:US9868720, No. 65 | [2-(2-Methyl-pyrrolidin- 1-yl)-6-piperidin-4-yl- pyrimidin-4-yl]-(4-tri- fluoromethyl-pyridin-2-yl)-amine
TypeSmall organic molecule
Emp. Form.C20H25F3N6
Mol. Mass.406.4479
SMILESCC1CCCN1c1nc(Nc2cc(ccn2)C(F)(F)F)cc(n1)C1CCNCC1