Reaction Details
TargetMitogen-activated protein kinase kinase kinase 12
LigandBDBM365232
Substrate/Competitorn/a
Meas. Tech.TR-FRET assay
Ki 4.80±n/a nM
Citation Cohen, FPatel, S C-linked heterocycloaklyl substituted pyrimidines and their uses US Patent US9868720 Publication Date 1/16/2018
 
Mitogen-activated protein kinase kinase kinase 12
Name:Mitogen-activated protein kinase kinase kinase 12
Type:PROTEIN
Mol. Mass.:93216.56
Organism:Homo sapiens (Human)
Description:ChEMBL_1460553
Residue:859
BDBM365232
NameBDBM365232
Synonyms:(2-Pyrrolidin-1-yl-6-pyr- rolidin-3-yl-pyrimidin- 4-yl)-(4-trifluoromethyl- pyridin-2-yl)-amine | US9868720, No. 66
TypeSmall organic molecule
Emp. Form.C18H21F3N6
Mol. Mass.378.3947
SMILESFC(F)(F)c1ccnc(Nc2cc(nc(n2)N2CCCC2)C2CCNC2)c1