Reaction Details
TargetMitogen-activated protein kinase kinase kinase 12
LigandBDBM365250
Substrate/Competitorn/a
Meas. Tech.TR-FRET assay
Ki 0.400±n/a nM
Citation Cohen, FPatel, S C-linked heterocycloaklyl substituted pyrimidines and their uses US Patent US9868720 Publication Date 1/16/2018
 
Mitogen-activated protein kinase kinase kinase 12
Name:Mitogen-activated protein kinase kinase kinase 12
Type:PROTEIN
Mol. Mass.:93216.56
Organism:Homo sapiens (Human)
Description:ChEMBL_1460553
Residue:859
BDBM365250
NameBDBM365250
Synonyms:US9868720, No. 169 | [6-(1-Methyl-piperidin- 4-yl)-2-((R)-2-methyl- pyrrolidin-1-yl)-pyrimidin- 4-yl]-(4-trifluoromethyl- pyridin-2-yl)-amine
TypeSmall organic molecule
Emp. Form.C21H27F3N6
Mol. Mass.420.4745
SMILESC[C@@H]1CCCN1c1nc(Nc2cc(ccn2)C(F)(F)F)cc(n1)C1CCN(C)CC1