Reaction Details
TargetMitogen-activated protein kinase kinase kinase 12
LigandBDBM365281
Substrate/Competitorn/a
Meas. Tech.TR-FRET assay
Ki 6.12±n/a nM
Citation Cohen, FPatel, S C-linked heterocycloaklyl substituted pyrimidines and their uses US Patent US9868720 Publication Date 1/16/2018
 
Mitogen-activated protein kinase kinase kinase 12
Name:Mitogen-activated protein kinase kinase kinase 12
Type:PROTEIN
Mol. Mass.:93216.56
Organism:Homo sapiens (Human)
Description:ChEMBL_1460553
Residue:859
BDBM365281
NameBDBM365281
Synonyms:1-Methyl-4-[2-(2-methyl- pyrrolidin-1-yl)-6-(4- trifluoromethyl-pyridin- 2-ylamino)-pyrimidin- 4-yl]-piperidin-2-one | US9868720, No. 332
TypeSmall organic molecule
Emp. Form.C21H25F3N6O
Mol. Mass.434.458
SMILESCC1CCCN1c1nc(Nc2cc(ccn2)C(F)(F)F)cc(n1)C1CCN(C)C(=O)C1