Reaction Details
TargetMitogen-activated protein kinase kinase kinase 12
LigandBDBM365298
Substrate/Competitorn/a
Meas. Tech.TR-FRET assay
Ki 4.92±n/a nM
Citation Cohen, FPatel, S C-linked heterocycloaklyl substituted pyrimidines and their uses US Patent US9868720 Publication Date 1/16/2018
 
Mitogen-activated protein kinase kinase kinase 12
Name:Mitogen-activated protein kinase kinase kinase 12
Type:PROTEIN
Mol. Mass.:93216.56
Organism:Homo sapiens (Human)
Description:ChEMBL_1460553
Residue:859
BDBM365298
NameBDBM365298
Synonyms:US9868720, No. 404 | {2-(3,3-Difluoro-pyrrolidin- 1-yl)-6-[1-(1H-pyrazol- 4-ylmethyl)-pyrrolidin- 3-yl]-pyrimidin-4- yl}-(4-trifluoromethyl- pyridin-2-yl)-amine
TypeSmall organic molecule
Emp. Form.C22H23F5N8
Mol. Mass.494.4636
SMILESFC(F)(F)c1ccnc(Nc2cc(nc(n2)N2CCC(F)(F)C2)C2CCN(Cc3cn[nH]c3)C2)c1