Reaction Details
TargetTransient receptor potential cation channel subfamily V member 1
LigandBDBM20577
Substrate/CompetitorBDBM10852
Meas. Tech.Capsaicin Antagonist Assay
IC50 2.5±n/a nM
Citation Wang, HLKaton, JBalan, CBannon, AWBernard, CDoherty, EMDominguez, CGavva, NRGore, VMa, VNishimura, NSurapaneni, STang, PTamir, RThiel, OTreanor, JJNorman, MH Novel vanilloid receptor-1 antagonists: 3. The identification of a second-generation clinical candidate with improved physicochemical and pharmacokinetic properties. J Med Chem50:3528-39 (2007) 
 
Transient receptor potential cation channel subfamily V member 1
Name:Transient receptor potential cation channel subfamily V member 1
Type:Transient Receptor
Mol. Mass.:94956.12
Organism:Rattus norvegicus (rat)
Description:O35433
Residue:838
BDBM20577
BDBM10852
NameBDBM20577
Synonyms:N-{4-[(6-{4-[(1S)-1-(2-fluorophenyl)ethyl]piperazin-1-yl}pyrimidin-4-yl)oxy]-1,3-benzothiazol-2-yl}acetamide | Piperazinylpyrimidine analogue, 17b
TypeSmall organic molecule
Emp. Form.C25H25FN6O2S
Mol. Mass.492.568
SMILESCC(N1CCN(CC1)c1cc(Oc2cccc3sc(NC(C)=O)nc23)ncn1)c1ccccc1F