Reaction Details
TargetEstrogen receptor
LigandBDBM20587
Substrate/Competitor17beta-estradiol (E2)
Meas. Tech.ER-alpha Radioligand Binding Assay and ERE-Luciferase Reporter Assay.
pH7.4±n/a
Temperature295.15±n/a K
IC50 38±2 nM
EC50 1.8±0.4 nM
CommentsAntagonist activity was not determined in MCF-7 assay; agonist activity was not determined in the MCF-7 proliferation assay in the absence of 17beta-estradiol.
Citation Renaud, JBischoff, SFBuhl, TFloersheim, PFournier, BHalleux, CKallen, JKeller, HSchlaeppi, JMStark, W Estrogen receptor modulators: identification and structure-activity relationships of potent ERalpha-selective tetrahydroisoquinoline ligands. J Med Chem46:2945-57 (2003) 
 
Estrogen receptor
Name:Estrogen receptor
Type:Protein
Mol. Mass.:66230.44
Organism:Homo sapiens (Human)
Description:P03372
Residue:595
BDBM20587
17beta-estradiol (E2)
NameBDBM20587
Synonyms:1-methyl-2-phenyl-1-{4-[2-(pyrrolidin-1-yl)ethoxy]phenyl}-1,2,3,4-tetrahydroisoquinolin-6-ol | tetrahydroisoquinoline derivative, 19a
TypeSmall organic molecule
Emp. Form.C28H32N2O2
Mol. Mass.428.5659
SMILESCC1(N(CCc2cc(O)ccc12)c1ccccc1)c1ccc(OCCN2CCCC2)cc1