Reaction Details
TargetEstrogen receptor
LigandBDBM20601
Substrate/Competitor17beta-estradiol (E2)
Meas. Tech.ER-alpha Radioligand Binding Assay and ERE-Luciferase Reporter Assay.
pH7.4±n/a
Temperature295.15±n/a K
IC50 66±38 nM
EC50 2.9±0.8 nM
CommentsAntagonist activity in MCF-7 assay, IC50 = 7.0 +/- 3.5 nM; in the absence of 17beta-estradiol in the MCF-7 proliferation assay, compound displayed 20 +/- 11 % agonistic effect.
Citation Renaud, JBischoff, SFBuhl, TFloersheim, PFournier, BHalleux, CKallen, JKeller, HSchlaeppi, JMStark, W Estrogen receptor modulators: identification and structure-activity relationships of potent ERalpha-selective tetrahydroisoquinoline ligands. J Med Chem46:2945-57 (2003) 
 
Estrogen receptor
Name:Estrogen receptor
Type:Protein
Mol. Mass.:66230.44
Organism:Homo sapiens (Human)
Description:P03372
Residue:595
BDBM20601
17beta-estradiol (E2)
NameBDBM20601
Synonyms:2-(3-chlorophenyl)-1-methyl-1-{4-[2-(pyrrolidin-1-yl)ethoxy]phenyl}-1,2,3,4-tetrahydroisoquinolin-6-ol | tetrahydroisoquinoline derivative, 19h
TypeSmall organic molecule
Emp. Form.C28H31ClN2O2
Mol. Mass.463.011
SMILESCC1(N(CCc2cc(O)ccc12)c1cccc(Cl)c1)c1ccc(OCCN2CCCC2)cc1