Reaction Details
TargetEstrogen receptor beta
LigandBDBM20594
Substrate/Competitor17beta-estradiol (E2)
Meas. Tech.ER-alpha Radioligand Binding Assay and ERE-Luciferase Reporter Assay.
Temperature298.15±n/a K
IC50 302±n/a nM
EC50 531±n/a nM
Commentsextracted
Citation Renaud, JBischoff, SFBuhl, TFloersheim, PFournier, BHalleux, CKallen, JKeller, HSchlaeppi, JMStark, W Estrogen receptor modulators: identification and structure-activity relationships of potent ERalpha-selective tetrahydroisoquinoline ligands. J Med Chem46:2945-57 (2003) 
 
Estrogen receptor beta
Name:Estrogen receptor beta
Type:Protein
Mol. Mass.:59238.43
Organism:Homo sapiens (Human)
Description:Q92731
Residue:530
BDBM20594
17beta-estradiol (E2)
NameBDBM20594
Synonyms:2-(4-chlorophenyl)-1-methyl-1-{4-[2-(pyrrolidin-1-yl)ethoxy]phenyl}-1,2,3,4-tetrahydroisoquinolin-6-ol | tetrahydroisoquinoline derivative, 19d
TypeSmall organic molecule
Emp. Form.C28H31ClN2O2
Mol. Mass.463.011
SMILESCC1(N(CCc2cc(O)ccc12)c1ccc(Cl)cc1)c1ccc(OCCN2CCCC2)cc1