Reaction Details
TargetEstrogen receptor beta
LigandBDBM20600
Substrate/Competitor17beta-estradiol (E2)
Meas. Tech.ER-alpha Radioligand Binding Assay and ERE-Luciferase Reporter Assay.
Temperature298.15±n/a K
IC50 123±n/a nM
EC50 198±n/a nM
Commentsextracted
Citation Renaud, JBischoff, SFBuhl, TFloersheim, PFournier, BHalleux, CKallen, JKeller, HSchlaeppi, JMStark, W Estrogen receptor modulators: identification and structure-activity relationships of potent ERalpha-selective tetrahydroisoquinoline ligands. J Med Chem46:2945-57 (2003) 
 
Estrogen receptor beta
Name:Estrogen receptor beta
Type:Protein
Mol. Mass.:59238.43
Organism:Homo sapiens (Human)
Description:Q92731
Residue:530
BDBM20600
17beta-estradiol (E2)
NameBDBM20600
Synonyms:2-(3-fluorophenyl)-1-methyl-1-{4-[2-(pyrrolidin-1-yl)ethoxy]phenyl}-1,2,3,4-tetrahydroisoquinolin-6-ol | tetrahydroisoquinoline derivative, 19g
TypeSmall organic molecule
Emp. Form.C28H31FN2O2
Mol. Mass.446.5563
SMILESCC1(N(CCc2cc(O)ccc12)c1cccc(F)c1)c1ccc(OCCN2CCCC2)cc1