Reaction Details
TargetEstrogen receptor beta
LigandBDBM20603
Substrate/Competitor17beta-estradiol (E2)
Meas. Tech.ER-alpha Radioligand Binding Assay and ERE-Luciferase Reporter Assay.
Temperature298.15±n/a K
IC50 1105±n/a nM
EC50 492±n/a nM
Commentsextracted
Citation Renaud, JBischoff, SFBuhl, TFloersheim, PFournier, BHalleux, CKallen, JKeller, HSchlaeppi, JMStark, W Estrogen receptor modulators: identification and structure-activity relationships of potent ERalpha-selective tetrahydroisoquinoline ligands. J Med Chem46:2945-57 (2003) 
 
Estrogen receptor beta
Name:Estrogen receptor beta
Type:Protein
Mol. Mass.:59238.43
Organism:Homo sapiens (Human)
Description:Q92731
Residue:530
BDBM20603
17beta-estradiol (E2)
NameBDBM20603
Synonyms:1-methyl-1-{4-[2-(piperidin-1-yl)ethoxy]phenyl}-2-[3-(propan-2-yl)phenyl]-1,2,3,4-tetrahydroisoquinolin-6-ol | tetrahydroisoquinoline derivative, 20i
TypeSmall organic molecule
Emp. Form.C32H40N2O2
Mol. Mass.484.6722
SMILESCC(C)c1cccc(c1)N1CCc2cc(O)ccc2C1(C)c1ccc(OCCN2CCCCC2)cc1