Reaction Details
TargetEstrogen receptor
LigandBDBM20610
Substrate/Competitor17beta-estradiol (E2)
Meas. Tech.ER-alpha Radioligand Binding Assay and ERE-Luciferase Reporter Assay.
pH7.4±n/a
Temperature295.15±n/a K
IC50 69±2 nM
EC50 34.9±3.3 nM
CommentsAntagonist activity in MCF-7 assay, IC50= 44 +/- 25 nM, 100% antagonism; in the absence of 17beta-estradiol in the MCF-7 proliferation assay, compound displayed 10 +/- 4 % agonistic effect.
Citation Renaud, JBischoff, SFBuhl, TFloersheim, PFournier, BGeiser, MHalleux, CKallen, JKeller, HRamage, P Selective estrogen receptor modulators with conformationally restricted side chains. Synthesis and structure-activity relationship of ERalpha-selective tetrahydroisoquinoline ligands. J Med Chem48:364-79 (2005) 
 
Estrogen receptor
Name:Estrogen receptor
Type:Protein
Mol. Mass.:66230.44
Organism:Homo sapiens (Human)
Description:P03372
Residue:595
BDBM20610
17beta-estradiol (E2)
NameBDBM20610
Synonyms:1-[4-(3,4-dimethylpiperazin-1-yl)phenyl]-2-phenyl-1,2,3,4-tetrahydroisoquinolin-6-ol | Piperazine Derivative, 30
TypeSmall organic molecule
Emp. Form.C27H31N3O
Mol. Mass.413.5545
SMILESCC1CN(CCN1C)c1ccc(cc1)C1N(CCc2cc(O)ccc12)c1ccccc1