Reaction Details
TargetEstrogen receptor
LigandBDBM20618
Substrate/Competitor17beta-estradiol (E2)
Meas. Tech.ER-alpha Radioligand Binding Assay and ERE-Luciferase Reporter Assay.
pH7.4±n/a
Temperature295.15±n/a K
IC50 169±53 nM
EC50 18.2±5.6 nM
CommentsAntagonist activity in MCF-7 assay, IC50= 110 +/- 17 nM, 100% antagonism; in the absence of 17beta-estradiol in the MCF-7 proliferation assay, compound displayed 7.6 +/- 1.6 % agonistic effect.
Citation Renaud, JBischoff, SFBuhl, TFloersheim, PFournier, BGeiser, MHalleux, CKallen, JKeller, HRamage, P Selective estrogen receptor modulators with conformationally restricted side chains. Synthesis and structure-activity relationship of ERalpha-selective tetrahydroisoquinoline ligands. J Med Chem48:364-79 (2005) 
 
Estrogen receptor
Name:Estrogen receptor
Type:Protein
Mol. Mass.:66230.44
Organism:Homo sapiens (Human)
Description:P03372
Residue:595
BDBM20618
17beta-estradiol (E2)
NameBDBM20618
Synonyms:2-(3-hydroxyphenyl)-1-[4-(4-methylpiperazin-1-yl)phenyl]-1,2,3,4-tetrahydroisoquinolin-6-ol | Piperazine Derivative, 45
TypeSmall organic molecule
Emp. Form.C26H29N3O2
Mol. Mass.415.5274
SMILESCN1CCN(CC1)c1ccc(cc1)C1N(CCc2cc(O)ccc12)c1cccc(O)c1