Reaction Details
TargetEstrogen receptor beta
LigandBDBM20614
Substrate/Competitor17beta-estradiol (E2)
Meas. Tech.ER-beta Radioligand Binding Assay and ERE-Luciferase Reporter Assay.
pH7.4±n/a
Temperature295.15±n/a K
IC50 266±66 nM
EC50 464±80 nM
CommentsAntagonist activity in MCF-7 assay, IC50= 45 +/- 19 nM, 100% antagonism; in the absence of 17beta-estradiol in the MCF-7 proliferation assay, compound displayed 12 +/- 4 % agonistic effect.
Citation Renaud, JBischoff, SFBuhl, TFloersheim, PFournier, BGeiser, MHalleux, CKallen, JKeller, HRamage, P Selective estrogen receptor modulators with conformationally restricted side chains. Synthesis and structure-activity relationship of ERalpha-selective tetrahydroisoquinoline ligands. J Med Chem48:364-79 (2005) 
 
Estrogen receptor beta
Name:Estrogen receptor beta
Type:Protein
Mol. Mass.:59238.43
Organism:Homo sapiens (Human)
Description:Q92731
Residue:530
BDBM20614
17beta-estradiol (E2)
NameBDBM20614
Synonyms:1-[4-(1-methylpiperidin-4-yl)phenyl]-2-phenyl-1,2,3,4-tetrahydroisoquinolin-6-ol | Piperidine Derivative, 38a
TypeSmall organic molecule
Emp. Form.C27H30N2O
Mol. Mass.398.5399
SMILESCN1CCC(CC1)c1ccc(cc1)C1N(CCc2cc(O)ccc12)c1ccccc1