Reaction Details
TargetEstrogen receptor
LigandBDBM19441
Substrate/Competitor17beta-estradiol (E2)
Meas. Tech.ER-alpha Radioligand Binding Assay and ERE-Luciferase Reporter Assay.
pH7.4±n/a
Temperature295.15±n/a K
IC50 22±n/a nM
CommentsNo agonist activity.
Citation Schopfer, USchoeffter, PBischoff, SFNozulak, JFeuerbach, DFloersheim, P Toward selective ERbeta agonists for central nervous system disorders: synthesis and characterization of aryl benzthiophenes. J Med Chem45:1399-401 (2002) 
 
Estrogen receptor
Name:Estrogen receptor
Type:Protein
Mol. Mass.:66230.44
Organism:Homo sapiens (Human)
Description:P03372
Residue:595
BDBM19441
17beta-estradiol (E2)
NameBDBM19441
Synonyms:2-(4-hydroxyphenyl)-3-({4-[2-(piperidin-1-yl)ethoxy]phenyl}carbonyl)-1-benzothiophen-6-ol Evista RALOXIFENE HYDROCHLORIDE Raloxifene (7) [6-hydroxy-2-(4-hydroxyphenyl)-1-benzothiophen-3-yl]-[4-(2-piperidin-1-ylethoxy)phenyl]methanone | cid_11071264
TypeSmall organic molecule
Emp. Form.C28H27NO4S
Mol. Mass.473.583
SMILESOc1ccc(cc1)-c1sc2cc(O)ccc2c1C(=O)c1ccc(OCCN2CCCCC2)cc1