Reaction Details
TargetEstrogen receptor beta
LigandBDBM20628
Substrate/Competitor17beta-estradiol (E2)
Meas. Tech.ER-beta Radioligand Binding Assay and ERE-Luciferase Reporter Assay.
pH7.4±n/a
Temperature295.15±n/a K
IC50 114±n/a nM
EC50 17±n/a nM
Citation Schopfer, USchoeffter, PBischoff, SFNozulak, JFeuerbach, DFloersheim, P Toward selective ERbeta agonists for central nervous system disorders: synthesis and characterization of aryl benzthiophenes. J Med Chem45:1399-401 (2002) 
 
Estrogen receptor beta
Name:Estrogen receptor beta
Type:Protein
Mol. Mass.:59238.43
Organism:Homo sapiens (Human)
Description:Q92731
Residue:530
BDBM20628
17beta-estradiol (E2)
NameBDBM20628
Synonyms:2-(4-hydroxyphenyl)-1-benzothiophen-6-ol benzthiophene compound, 3
TypeSmall organic molecule
Emp. Form.C14H10O2S
Mol. Mass.242.293
SMILESOc1ccc(cc1)-c1cc2ccc(O)cc2s1