Reaction Details
TargetThymidylate synthase
LigandBDBM20676
Substrate/CompetitorBDBM18754
Meas. Tech.Thymidylate Synthase (TS) Assay
pH7.4±n/a
Temperature303.15±n/a K
IC50 46±n/a nM
Citation Gangjee, ALi, WYang, JKisliuk, RL Design, synthesis, and biological evaluation of classical and nonclassical 2-amino-4-oxo-5-substituted-6-methylpyrrolo[3,2-d]pyrimidines as dual thymidylate synthase and dihydrofolate reductase inhibitors. J Med Chem51:68-76 (2008) 
 
Thymidylate synthase
Name:Thymidylate synthase
Type:Enzyme
Mol. Mass.:35718.07
Organism:Homo sapiens (Human)
Description:n/a
Residue:313
BDBM20676
BDBM18754
NameBDBM20676
Synonyms:(2S)-2-{[4-({2-amino-6-methyl-4-oxo-3H,4H,5H-pyrrolo[3,2-d]pyrimidin-5-yl}methyl)phenyl]formamido}pentanedioic acid | Pyrrolo[3,2-d]pyrimidine analogue, 4
TypeSmall organic molecule
Emp. Form.C20H21N5O6
Mol. Mass.427.4106
SMILESCc1cc2nc(N)[nH]c(=O)c2n1Cc1ccc(cc1)C(=O)N[C@@H](CCC(O)=O)C(O)=O