Reaction Details
TargetThymidylate synthase
LigandBDBM18797
Substrate/CompetitorBDBM18754
Meas. Tech.Thymidylate Synthase (TS) Assay
pH7.4±n/a
Temperature303.15±n/a K
IC50 270±n/a nM
Citation Gangjee, ALi, WYang, JKisliuk, RL Design, synthesis, and biological evaluation of classical and nonclassical 2-amino-4-oxo-5-substituted-6-methylpyrrolo[3,2-d]pyrimidines as dual thymidylate synthase and dihydrofolate reductase inhibitors. J Med Chem51:68-76 (2008) 
 
Thymidylate synthase
Name:Thymidylate synthase
Type:Enzyme
Mol. Mass.:30475.81
Organism:Escherichia coli
Description:n/a
Residue:264
BDBM18797
BDBM18754
NameBDBM18797
Synonyms:(2S)-2-{[4-({2-amino-6-methyl-4-oxo-3H,4H,7H-pyrrolo[2,3-d]pyrimidin-5-yl}sulfanyl)phenyl]formamido}pentanedioic acid Pyrrolo[2,3-d]pyrimidine analogue, 1
TypeSmall organic molecule
Emp. Form.C19H19N5O6S
Mol. Mass.445.449
SMILESCc1[nH]c2nc(N)[nH]c(=O)c2c1Sc1ccc(cc1)C(=O)N[C@@H](CCC(O)=O)C(O)=O