Reaction Details
TargetThymidylate synthase
LigandBDBM20682
Substrate/CompetitorBDBM18754
Meas. Tech.Thymidylate Synthase (TS) Assay
pH7.4±n/a
Temperature303.15±n/a K
IC50 14000±n/a nM
Citation Gangjee, ALi, WYang, JKisliuk, RL Design, synthesis, and biological evaluation of classical and nonclassical 2-amino-4-oxo-5-substituted-6-methylpyrrolo[3,2-d]pyrimidines as dual thymidylate synthase and dihydrofolate reductase inhibitors. J Med Chem51:68-76 (2008) 
 
Thymidylate synthase
Name:Thymidylate synthase
Type:Enzyme
Mol. Mass.:30475.81
Organism:Escherichia coli
Description:n/a
Residue:264
BDBM20682
BDBM18754
NameBDBM20682
Synonyms:2-amino-6-methyl-5-[(4-nitrophenyl)methyl]-3H,4H,5H-pyrrolo[3,2-d]pyrimidin-4-one | Pyrrolo[3,2-d]pyrimidine analogue, 10
TypeSmall organic molecule
Emp. Form.C14H13N5O3
Mol. Mass.299.2847
SMILESCc1cc2nc(N)[nH]c(=O)c2n1Cc1ccc(cc1)[N+]([O-])=O