Reaction Details
Target3-phosphoinositide-dependent protein kinase 1 [51-360]
LigandBDBM366145
Substrate/Competitorn/a
Meas. Tech.Kinase Assay
IC50<500±n/a nM
Citation Lind, KECao, KLin, EYNguyen, TBTangonan, BTErlanson, DAGuckian, KSimmons, RLLee, WSun, LHansen, SPathan, NZhang, L Methods of treatment using pyridinonyl PDK1 inhibitors US Patent US9873693 Publication Date 1/23/2018
 
3-phosphoinositide-dependent protein kinase 1 [51-360]
Name:3-phosphoinositide-dependent protein kinase 1 [51-360]
Type:Enzyme Catalytic Domain
Mol. Mass.:35373.34
Organism:Homo sapiens (Human)
Description:(aa 51-360)
Residue:310
BDBM366145
NameBDBM366145
Synonyms:US9873693, Compound 68
TypeSmall organic molecule
Emp. Form.C30H26F2N4O5
Mol. Mass.560.548
SMILESOCC(O)COc1cc(CNC(=O)c2cccn(Cc3ccc(F)c(F)c3)c2=O)cc(c1)-c1c[nH]c2ncccc12