Reaction Details
Target3-phosphoinositide-dependent protein kinase 1 [51-360]
LigandBDBM366233
Substrate/Competitorn/a
Meas. Tech.Kinase Assay
IC50<500±n/a nM
Citation Lind, KECao, KLin, EYNguyen, TBTangonan, BTErlanson, DAGuckian, KSimmons, RLLee, WSun, LHansen, SPathan, NZhang, L Methods of treatment using pyridinonyl PDK1 inhibitors US Patent US9873693 Publication Date 1/23/2018
 
3-phosphoinositide-dependent protein kinase 1 [51-360]
Name:3-phosphoinositide-dependent protein kinase 1 [51-360]
Type:Enzyme Catalytic Domain
Mol. Mass.:35373.34
Organism:Homo sapiens (Human)
Description:(aa 51-360)
Residue:310
BDBM366233
NameBDBM366233
Synonyms:US9873693, Compound 156
TypeSmall organic molecule
Emp. Form.C23H18F3N5O5
Mol. Mass.501.4147
SMILESNC(=O)[C@H](COc1ccc2[nH]c(=O)[nH]c2c1)NC(=O)c1cccn(Cc2cc(F)c(F)c(F)c2)c1=O