Reaction Details
Target3-phosphoinositide-dependent protein kinase 1 [51-360]
LigandBDBM366092
Substrate/Competitorn/a
Meas. Tech.Kinase Assay
IC50<500±n/a nM
Citation Lind, KECao, KLin, EYNguyen, TBTangonan, BTErlanson, DAGuckian, KSimmons, RLLee, WSun, LHansen, SPathan, NZhang, L Methods of treatment using pyridinonyl PDK1 inhibitors US Patent US9873693 Publication Date 1/23/2018
 
3-phosphoinositide-dependent protein kinase 1 [51-360]
Name:3-phosphoinositide-dependent protein kinase 1 [51-360]
Type:Enzyme Catalytic Domain
Mol. Mass.:35373.34
Organism:Homo sapiens (Human)
Description:(aa 51-360)
Residue:310
BDBM366092
NameBDBM366092
Synonyms:US9873693, Compound 15 | US9873693, Compound 234
TypeSmall organic molecule
Emp. Form.C27H20F2N4O4S
Mol. Mass.534.534
SMILESOC(=O)C[C@@H](NC(=O)c1cccn(Cc2ccc(F)c(F)c2)c1=O)c1ccc(s1)-c1c[nH]c2ncccc12