Reaction Details
TargetTyrosine-protein kinase JAK1
LigandBDBM366678
Substrate/Competitorn/a
Meas. Tech.Enzyme Assay
Ki 0.210±n/a nM
Citation Ray, NCCheng, YEdwards, CGoodacre, SCLi, WPatel, SCartwright, MWSajad, MYuen, PZak, ME Triazolopyridine compounds, compositions and methods of use thereof US Patent US9873709 Publication Date 1/23/2018
 
Tyrosine-protein kinase JAK1
Name:Tyrosine-protein kinase JAK1
Type:Protein
Mol. Mass.:133293.73
Organism:Homo sapiens (Human)
Description:P23458
Residue:1154
BDBM366678
NameBDBM366678
Synonyms:US9873709, Example 1-275 | [4-[[8-[4-(4- chlorophenyl)-4- (hydroxymethyl)-1- piperidyl]- [1,2,4]triazolo[1,5- a]pyridin-2- yl]amino]phenyl]-(1- methyl-2,3,3a,4,6,6a- hexahydropyrrolo[2,3- c]pyrrol-5- yl)methanone
TypeSmall organic molecule
Emp. Form.C32H36ClN7O2
Mol. Mass.586.127
SMILESCN1CCC2CN(CC12)C(=O)c1ccc(Nc2nc3c(cccn3n2)N2CCC(CO)(CC2)c2ccc(Cl)cc2)cc1