Reaction Details
TargetTyrosine-protein kinase JAK2
LigandBDBM366680
Substrate/Competitorn/a
Meas. Tech.Enzyme Assay
Ki 0.240±n/a nM
Citation Ray, NCCheng, YEdwards, CGoodacre, SCLi, WPatel, SCartwright, MWSajad, MYuen, PZak, ME Triazolopyridine compounds, compositions and methods of use thereof US Patent US9873709 Publication Date 1/23/2018
 
Tyrosine-protein kinase JAK2
Name:Tyrosine-protein kinase JAK2
Type:Protein
Mol. Mass.:130684.68
Organism:Homo sapiens (Human)
Description:O60674
Residue:1132
BDBM366680
NameBDBM366680
Synonyms:4-[[8-[4-(4- chlorophenyl)-4- (hydroxymethyl)-1- piperidyl]- [1,2,4]triazolo[1,5- a]pyridin-2-yl]amino]- N-[2-[(2S,6S)-2,6- dimethylmorpholin-4- yl]ethyl]benzamide | US9873709, Example 1-277
TypeSmall organic molecule
Emp. Form.C33H40ClN7O3
Mol. Mass.618.169
SMILESC[C@H]1CN(CCNC(=O)c2ccc(Nc3nc4c(cccn4n3)N3CCC(CO)(CC3)c3ccc(Cl)cc3)cc2)C[C@H](C)O1