Reaction Details
TargetTyrosine-protein kinase JAK2
LigandBDBM366682
Substrate/Competitorn/a
Meas. Tech.Enzyme Assay
Ki 0.250±n/a nM
Citation Ray, NCCheng, YEdwards, CGoodacre, SCLi, WPatel, SCartwright, MWSajad, MYuen, PZak, ME Triazolopyridine compounds, compositions and methods of use thereof US Patent US9873709 Publication Date 1/23/2018
 
Tyrosine-protein kinase JAK2
Name:Tyrosine-protein kinase JAK2
Type:Protein
Mol. Mass.:130684.68
Organism:Homo sapiens (Human)
Description:O60674
Residue:1132
BDBM366682
NameBDBM366682
Synonyms:US9873709, Example 1-279 | [4-[[8-[4-(4- chlorophenyl)-4- (hydroxymethyl)-1- piperidyl]- [1,2,4]triazolo[1,5- a]pyridin-2- yl]amino]phenyl]-[3- (4-pyridyl)pyrrolidin- 1-yl]methanone
TypeSmall organic molecule
Emp. Form.C34H34ClN7O2
Mol. Mass.608.132
SMILESOCC1(CCN(CC1)c1cccn2nc(Nc3ccc(cc3)C(=O)N3CCC(C3)c3ccncc3)nc12)c1ccc(Cl)cc1