Reaction Details
TargetTyrosine-protein kinase JAK2
LigandBDBM366713
Substrate/Competitorn/a
Meas. Tech.Enzyme Assay
Ki 0.250±n/a nM
Citation Ray, NCCheng, YEdwards, CGoodacre, SCLi, WPatel, SCartwright, MWSajad, MYuen, PZak, ME Triazolopyridine compounds, compositions and methods of use thereof US Patent US9873709 Publication Date 1/23/2018
 
Tyrosine-protein kinase JAK2
Name:Tyrosine-protein kinase JAK2
Type:Protein
Mol. Mass.:130684.68
Organism:Homo sapiens (Human)
Description:O60674
Residue:1132
BDBM366713
NameBDBM366713
Synonyms:US9873709, Example 2-7 | cyanomethyl 4-[2-[4- [methyl-(1-methyl-4- piperidyl)carbamoyl] anilino]- [1,2,4]triazolo[1,5- a]pyridin-8-yl]-3,6- dihydro-2H-pyridine- 1-carboxylate
TypeSmall organic molecule
Emp. Form.C28H32N8O3
Mol. Mass.528.6055
SMILESCN(C1CCN(C)CC1)C(=O)c1ccc(Nc2nc3c(cccn3n2)C2=CCN(CC2)C(=O)OCC#N)cc1