Reaction Details
TargetTyrosine-protein kinase JAK1
LigandBDBM366981
Substrate/Competitorn/a
Meas. Tech.Enzyme Assay
Ki 0.680±n/a nM
Citation Ray, NCCheng, YEdwards, CGoodacre, SCLi, WPatel, SCartwright, MWSajad, MYuen, PZak, ME Triazolopyridine compounds, compositions and methods of use thereof US Patent US9873709 Publication Date 1/23/2018
 
Tyrosine-protein kinase JAK1
Name:Tyrosine-protein kinase JAK1
Type:Protein
Mol. Mass.:133293.73
Organism:Homo sapiens (Human)
Description:P23458
Residue:1154
BDBM366981
NameBDBM366981
Synonyms:4,4,4-trifluoro-1-[4-[2- [4-[4-(3- pyridylmethyl) piperidine-1- carbonyl]anilino]- [1,2,4]triazolo[1,5- a]pyridin-8-yl]-3,6- dihydro-2H-pyridin-1- yl]butan-1-one | US9873709, Example 2-277
TypeSmall organic molecule
Emp. Form.C33H34F3N7O2
Mol. Mass.617.664
SMILESFC(F)(F)CCC(=O)N1CCC(=CC1)c1cccn2nc(Nc3ccc(cc3)C(=O)N3CCC(Cc4cccnc4)CC3)nc12