Reaction Details
TargetTyrosine-protein kinase JAK2
LigandBDBM367169
Substrate/Competitorn/a
Meas. Tech.Enzyme Assay
Ki 0.260±n/a nM
Citation Ray, NCCheng, YEdwards, CGoodacre, SCLi, WPatel, SCartwright, MWSajad, MYuen, PZak, ME Triazolopyridine compounds, compositions and methods of use thereof US Patent US9873709 Publication Date 1/23/2018
 
Tyrosine-protein kinase JAK2
Name:Tyrosine-protein kinase JAK2
Type:Protein
Mol. Mass.:130684.68
Organism:Homo sapiens (Human)
Description:O60674
Residue:1132
BDBM367169
NameBDBM367169
Synonyms:4,4,4-trifluoro-1-[4-[2- [4-[4-(6-methyl-2- pyridyl)piperidine-1- carbonyl]anilino]- [1,2,4]triazolo[1,5- a]pyridin-8-yl]-3,6- dihydro-2H-pyridin-1- yl]butan-1-one | US9873709, Example 2-468
TypeSmall organic molecule
Emp. Form.C33H34F3N7O2
Mol. Mass.617.664
SMILESCc1cccc(n1)C1CCN(CC1)C(=O)c1ccc(Nc2nc3c(cccn3n2)C2=CCN(CC2)C(=O)CCC(F)(F)F)cc1