Reaction Details
TargetHeat shock protein HSP 90-alpha
LigandBDBM20734
Substrate/CompetitorBDBM20732
Meas. Tech.Hsp90 Fluorescence Polarization Binding Assay
pH7.3±n/a
Temperature295.15±n/a K
IC50 60±30 nM
Citation Gopalsamy, AShi, MGolas, JVogan, EJacob, JJohnson, MLee, FNilakantan, RPetersen, RSvenson, KChopra, RTam, MSWen, YEllingboe, JArndt, KBoschelli, F Discovery of benzisoxazoles as potent inhibitors of chaperone heat shock protein 90. J Med Chem51:373-5 (2008) 
 
Heat shock protein HSP 90-alpha
Name:Heat shock protein HSP 90-alpha
Type:Molecular Chaperone
Mol. Mass.:84623.45
Organism:Homo sapiens (Human)
Description:P07900
Residue:732
BDBM20734
BDBM20732
NameBDBM20734
Synonyms:4-chloro-6-(6-hydroxy-1,2-benzoxazol-3-yl)benzene-1,3-diol CHEMBL362307
TypeSmall organic molecule
Emp. Form.C13H8ClNO4
Mol. Mass.277.66
SMILESOc1ccc2c(noc2c1)-c1cc(Cl)c(O)cc1O