Reaction Details
TargetHeat shock protein HSP 90-alpha
LigandBDBM20732
Substrate/CompetitorBDBM20732
Meas. Tech.Hsp90 Fluorescence Polarization Binding Assay
pH7.3±n/a
Temperature295.15±n/a K
IC50 20±9 nM
Citation Gopalsamy, AShi, MGolas, JVogan, EJacob, JJohnson, MLee, FNilakantan, RPetersen, RSvenson, KChopra, RTam, MSWen, YEllingboe, JArndt, KBoschelli, F Discovery of benzisoxazoles as potent inhibitors of chaperone heat shock protein 90. J Med Chem51:373-5 (2008) 
 
Heat shock protein HSP 90-alpha
Name:Heat shock protein HSP 90-alpha
Type:Molecular Chaperone
Mol. Mass.:84623.45
Organism:Homo sapiens (Human)
Description:P07900
Residue:732
BDBM20732
BDBM20732
NameBDBM20732
Synonyms:(4E,6Z,8S,9S,10E,12S,13R,14S,16R)-13-hydroxy-8,14,19-trimethoxy-4,10,12,16-tetramethyl-3,20,22-trioxo-2-azabicyclo[16.3.1]docosa-1(21),4,6,10,18-pentaen-9-yl carbamate CHEMBL278315 Geldanamycin | geldanomycin
Typen/a
Emp. Form.C29H40N2O9
Mol. Mass.560.6359
SMILESCO[C@H]1CC(C)=Cc2c(O)c(NC(=O)C(C)=CC=C[C@H](OC)[C@@H](OC(N)=O)\C(C)=C\[C@H](C)[C@H]1O)cc(O)c2OC