Reaction Details
TargetHeat shock protein HSP 90-beta
LigandBDBM20745
Substrate/CompetitorBDBM10852
Meas. Tech.Her-2 Degradation Assay
pH7.2±n/a
Temperature310.15±n/a K
EC50 280±n/a nM
CommentsIC50=0.7 uM in MTS cell-growth inhibition assay.
Citation Biamonte, MAShi, JHong, KHurst, DCZhang, LFan, JBusch, DJKarjian, PLMaldonado, AASensintaffar, JLYang, YCKamal, ALough, RELundgren, KBurrows, FJTimony, GABoehm, MFKasibhatla, SR Orally active purine-based inhibitors of the heat shock protein 90. J Med Chem49:817-28 (2006) 
 
Heat shock protein HSP 90-beta
Name:Heat shock protein HSP 90-beta
Type:Molecular Chaperone
Mol. Mass.:83229.45
Organism:Homo sapiens (Human)
Description:P08238
Residue:724
BDBM20745
BDBM10852
NameBDBM20745
Synonyms:8-Sulfanyladenine CHEMBL191635 | Pent-4-ynyl analogue, 4
TypeSmall organic molecule
Emp. Form.C17H16IN5OS
Mol. Mass.465.311
SMILESCOc1ccc(I)c(Sc2nc3c(N)ncnc3n2CCCC#C)c1